{"text_format":"1","workbook":"xlsx","n_sheets":2,"sheets":["ENIGMA","LOOKUP"],"not_rendered":{"charts":3,"images":0,"macros":1,"external_links":0,"defined_names":2,"comments":0,"pivot_tables":0},"unopened":[],"bounds":{"document_bytes":16777216,"sheet_cells":100000,"rows_first":2000,"rows_last":500,"rows_between":2000,"halvings":0,"cell_chars":16384,"cell_head_chars":4096},"cells_cut":0,"cells_raw":0,"read":"whole","date_system":"1900"}

{"sheet":"ENIGMA","index":0,"n_rows":94,"n_cols":90,"rows_kept":94,"cut":false,"hidden":false,"merged":[[47,48,47,49],[8,1,8,5],[8,48,8,49],[0,1,0,5],[0,9,0,16],[0,21,0,28],[0,32,0,39],[0,46,0,49],[15,11,15,16],[15,23,15,28],[15,34,15,39],[47,35,47,47],[8,35,8,47],[8,6,8,32],[47,1,47,6],[47,9,47,32],[1,2,1,49],[15,21,15,22],[15,9,15,10],[15,32,15,33],[13,2,13,5],[13,9,13,16],[13,21,13,28],[13,32,13,39],[13,46,13,49],[3,9,3,10],[5,9,5,10],[3,32,3,33],[5,32,5,33],[5,21,5,22],[3,21,3,22]]}
[]
[]
[]
[null,null,null,null,null,null,null,null,null,"I",null,null,null,null,null,null,null,null,null,null,null,"II",null,null,null,null,null,null,null,null,null,null,"III"]
[]
[null,null,null,null,null,null,null,null,null,1,null,null,null,null,null,null,null,null,null,null,null,1,null,null,null,null,null,null,null,null,null,null,1]
[]
[]
[null,"MESSAGE",null,null,null,null,"STEPHENPEEK",null,null,null,null,null,null,null,null,null,null,null,null,null,null,null,null,null,null,null,null,null,null,null,null,null,null,null,null,"UNENCRYPTED LETTER",null,null,null,null,null,null,null,null,null,null,null,null,"S"]
[]
[]
[]
[]
[null,null,"UKW B",null,null,null,null,null,null,"Rotor Position 1",null,null,null,null,null,null,null,null,null,null,null,"Rotor Position 2",null,null,null,null,null,null,null,null,null,null,"Rotor Position 3",null,null,null,null,null,null,null,null,"ETW",null,null,null,null,"STECKER"]
[]
[null,null,null,null,null,null,null,null,null,"Start",null,{"$f":"M20","v":1},null,null,null,null,null,null,null,null,null,"Start",null,{"$f":"Y20","v":1},null,null,null,null,null,null,null,null,"Start",null,{"$f":"AJ20","v":1}]
[null,null,null,{"$f":"MAX(D20:D45)","v":3},{"$f":"MAX(E20:E45)","v":3},null,null,{"$f":"MAX(H20:H45)","v":18},{"$f":"MAX(I20:I45)","v":25},null,null,null,null,null,{"$f":"MAX(O20:O45)","v":18},{"$f":"MAX(P20:P45)","v":25},null,null,null,{"$f":"MAX(T20:T45)","v":7},{"$f":"MAX(U20:U45)","v":22},null,null,null,null,null,{"$f":"MAX(AA20:AA45)","v":7},{"$f":"MAX(AB20:AB45)","v":22},null,null,{"$f":"MAX(AE20:AE45)","v":19},{"$f":"MAX(AF20:AF45)","v":12},null,null,null,null,null,{"$f":"MAX(AL20:AL45)","v":19},{"$f":"MAX(AM20:AM45)","v":12},null,null,null,null,{"$f":"MAX(AR20:AR45)","v":19},{"$f":"MAX(AS20:AS45)","v":12},null,null,null,null,null,null,{"$f":"MAX(AZ20:AZ45)","v":19},{"$f":"MAX(BA20:BA45)","v":12}]
[null,null,null,"<-","->",null,null,"<-","->",null,null,null,null,null,"<-","->",null,"LETTER",null,"<-","->",null,null,null,null,null,"<-","->",null,null,"<-","->",null,null,null,null,null,"<-","->",null,null,null,null,"L","R",null,null,null,null,null,null,"L","R"]
[]
[null,25,1,{"$f":"IF(H20=$H$17,B20,\"\")","v":""},{"$f":"IF(C20=$D$17,C20,\"\")","v":""},{"$f":"IF(D20<>\"\",\"<-\",IF(E20<>\"\",\"->\",\"\"))","v":""},null,{"$f":"IF(K20=$O$17,K20,\"\")","v":""},{"$f":"IF($E$17=E20,K20,\"\")","v":""},{"$f":"IF(H20<>\"\",\"<-\",IF(I20<>\"\",\"->\",\"\"))","v":""},21,null,1,{"$f":"IF(O20<>\"\",\"<-\",IF(P20<>\"\",\"->\",\"\"))","v":""},{"$f":"IF(T20=$T$17,M20,\"\")","v":""},{"$f":"IF(M20=$I$17,M20,\"\")","v":""},{"$f":"M20","v":1},"A",null,{"$f":"IF(W20=$AA$17,W20,\"\")","v":""},{"$f":"IF($P$17=M20,W20,\"\")","v":""},{"$f":"IF(T20<>\"\",\"<-\",IF(U20<>\"\",\"->\",\"\"))","v":""},1,null,1,{"$f":"IF(AA20<>\"\",\"<-\",IF(AB20<>\"\",\"->\",\"\"))","v":""},{"$f":"IF(AE20=$AE$17,Y20,\"\")","v":""},{"$f":"IF(Y20=$U$17,Y20,\"\")","v":""},{"$f":"Y20","v":1},null,{"$f":"IF(AH20=$AL$17,AH20,\"\")","v":""},{"$f":"IF($AB$17=Y20,AH20,\"\")","v":""},{"$f":"IF(AE20<>\"\",\"<-\",IF(AF20<>\"\",\"->\",\"\"))","v":""},20,null,1,{"$f":"IF(AL20<>\"\",\"<-\",IF(AM20<>\"\",\"->\",\"\"))","v":""},{"$f":"IF(ROW(AJ20)-19=$AR$17,AJ20,\"\")","v":""},{"$f":"IF(AJ20=$AF$17,AJ20,\"\")","v":""},{"$f":"AJ20","v":1},null,{"$f":"AU20","v":""},null,{"$f":"IF(AT20=$AZ$17,AY20,\"\")","v":""},{"$f":"IF($AM$17=AM20,AT20,\"\")","v":""},{"$f":"VLOOKUP($AV20,LOOKUP!$Y$2:$Z$27,2,FALSE)","v":1},{"$f":"IF(AR20<>\"\",\"<-\",IF(AS20<>\"\",\"->\",\"\"))","v":""},"A","A",{"$f":"IF(AZ20<>\"\",\"<-\",IF(BA20<>\"\",\"->\",\"\"))","v":""},{"$f":"VLOOKUP($AW20,LOOKUP!$Y$2:$Z$27,2,FALSE)","v":1},{"$f":"IF(AW20=$AW$9,AY20,\"\")","v":""},{"$f":"IF(AY20=$AS$17,AT20,\"\")","v":""}]
[null,18,2,"","",{"$f":"IF(D21<>\"\",\"<-\",IF(E21<>\"\",\"->\",\"\"))","v":""},null,{"$f":"IF(K21=$O$17,K21,\"\")","v":""},"","",23,null,2,"",{"$f":"IF(T21=$T$17,M21,\"\")","v":""},{"$f":"IF(M21=$I$17,M21,\"\")","v":""},{"$f":"M21","v":2},"B",null,{"$f":"IF(W21=$AA$17,W21,\"\")","v":""},{"$f":"IF($P$17=M21,W21,\"\")","v":""},"",10,null,2,"",{"$f":"IF(AE21=$AE$17,Y21,\"\")","v":""},{"$f":"IF(Y21=$U$17,Y21,\"\")","v":""},{"$f":"Y21","v":2},null,{"$f":"IF(AH21=$AL$17,AH21,\"\")","v":""},{"$f":"IF($AB$17=Y21,AH21,\"\")","v":""},"",1,null,2,"",{"$f":"IF(ROW(AJ21)-19=$AR$17,AJ21,\"\")","v":""},{"$f":"IF(AJ21=$AF$17,AJ21,\"\")","v":""},{"$f":"AJ21","v":2},null,{"$f":"AU21","v":""},null,"",{"$f":"IF($AM$17=AM21,AT21,\"\")","v":""},{"$f":"VLOOKUP($AV21,LOOKUP!$Y$2:$Z$27,2,FALSE)","v":2},{"$f":"IF(AR21<>\"\",\"<-\",IF(AS21<>\"\",\"->\",\"\"))","v":""},"B","B",{"$f":"IF(AZ21<>\"\",\"<-\",IF(BA21<>\"\",\"->\",\"\"))","v":""},{"$f":"VLOOKUP($AW21,LOOKUP!$Y$2:$Z$27,2,FALSE)","v":2},{"$f":"IF(AW21=$AW$9,AY21,\"\")","v":""},{"$f":"IF(AY21=$AS$17,AT21,\"\")","v":""}]
[null,21,3,"",3,"->",null,"",25,"->",25,null,3,"","","",3,"C",null,"","","",16,null,3,"","","",3,null,"","","",7,null,3,"","","",3,null,"",null,"","",{"$f":"VLOOKUP($AV22,LOOKUP!$Y$2:$Z$27,2,FALSE)","v":3},"","C","C","",{"$f":"VLOOKUP($AW22,LOOKUP!$Y$2:$Z$27,2,FALSE)","v":3},"",""]
[null,8,4,"","","",null,"","","",7,null,4,"","","",4,"D",null,"","","",3,null,4,"","","",4,null,"","","",2,null,4,"","","",4,null,"",null,"","",{"$f":"VLOOKUP($AV23,LOOKUP!$Y$2:$Z$27,2,FALSE)","v":4},"","D","D","",{"$f":"VLOOKUP($AW23,LOOKUP!$Y$2:$Z$27,2,FALSE)","v":4},"",""]
[null,17,5,"","","",null,"","","",1,null,5,"","","",5,"E",null,"","","",26,"X",5,"","","",5,null,"","","",16,null,5,"","","",5,null,"",null,"","",{"$f":"VLOOKUP($AV24,LOOKUP!$Y$2:$Z$27,2,FALSE)","v":5},"","E","E","",{"$f":"VLOOKUP($AW24,LOOKUP!$Y$2:$Z$27,2,FALSE)","v":5},"",""]
[null,19,6,"","","",null,"","","",4,null,6,"","","",6,"F",null,"","","",23,null,6,"","","",6,null,"","","",3,null,6,"","","",6,null,"",null,"","",{"$f":"VLOOKUP($AV25,LOOKUP!$Y$2:$Z$27,2,FALSE)","v":6},"","F","F","",{"$f":"VLOOKUP($AW25,LOOKUP!$Y$2:$Z$27,2,FALSE)","v":6},"",""]
[null,12,7,"","","",null,"","","",6,null,7,"","","",7,"G",null,"","","",18,null,7,"<-",7,"",7,null,19,"","<-",19,null,7,"","","",7,null,"",null,"","",{"$f":"VLOOKUP($AV26,LOOKUP!$Y$2:$Z$27,2,FALSE)","v":7},"","G","G","",{"$f":"VLOOKUP($AW26,LOOKUP!$Y$2:$Z$27,2,FALSE)","v":7},"",""]
[null,4,8,"","","",null,"","","",16,null,8,"","","",8,"H",null,"","","",12,null,8,"","","",8,null,"","","",4,null,8,"","","",8,null,"",null,"","",{"$f":"VLOOKUP($AV27,LOOKUP!$Y$2:$Z$27,2,FALSE)","v":8},"","H","H","",{"$f":"VLOOKUP($AW27,LOOKUP!$Y$2:$Z$27,2,FALSE)","v":8},"",""]
[null,16,9,"","","",null,"","","",22,null,9,"","","",9,"I",null,"","","",6,null,9,"","","",9,null,"","","",17,null,9,"","","",9,null,"",null,"","",{"$f":"VLOOKUP($AV28,LOOKUP!$Y$2:$Z$27,2,FALSE)","v":9},"","I","I","",{"$f":"VLOOKUP($AW28,LOOKUP!$Y$2:$Z$27,2,FALSE)","v":9},"",""]
[null,24,10,"","","",null,"","","",26,null,10,"","","",10,"J",null,"","","",2,null,10,"","","",10,null,"","","",5,null,10,"","","",10,null,"",null,"","",{"$f":"VLOOKUP($AV29,LOOKUP!$Y$2:$Z$27,2,FALSE)","v":10},"","J","J","",{"$f":"VLOOKUP($AW29,LOOKUP!$Y$2:$Z$27,2,FALSE)","v":10},"",""]
[null,14,11,"","","",null,"","","",2,null,11,"","","",11,"K",null,"","","",4,null,11,"","","",11,null,"","","",21,null,11,"","","",11,null,"",null,"","",{"$f":"VLOOKUP($AV30,LOOKUP!$Y$2:$Z$27,2,FALSE)","v":11},"","K","K","",{"$f":"VLOOKUP($AW30,LOOKUP!$Y$2:$Z$27,2,FALSE)","v":11},"",""]
[null,7,12,"","","",null,"","","",5,null,12,"","","",12,"L",null,"","","",11,null,12,"","","",12,null,"","","",6,null,12,"->","",12,12,null,"->",null,"",12,{"$f":"VLOOKUP($AV31,LOOKUP!$Y$2:$Z$27,2,FALSE)","v":12},"->","L","L","->",{"$f":"VLOOKUP($AW31,LOOKUP!$Y$2:$Z$27,2,FALSE)","v":12},"",12]
[null,15,13,"","","",null,"","","",3,null,13,"","","",13,"M",null,"","","",15,null,13,"","","",13,null,"","","",22,null,13,"","","",13,null,"",null,"","",{"$f":"VLOOKUP($AV32,LOOKUP!$Y$2:$Z$27,2,FALSE)","v":13},"","M","M","",{"$f":"VLOOKUP($AW32,LOOKUP!$Y$2:$Z$27,2,FALSE)","v":13},"",""]
[null,11,14,"","","",null,"","","",11,null,14,"","","",14,"N",null,"","","",20,null,14,"","","",14,null,"","","",14,null,14,"","","",14,null,"",null,"","",{"$f":"VLOOKUP($AV33,LOOKUP!$Y$2:$Z$27,2,FALSE)","v":14},"","N","N","",{"$f":"VLOOKUP($AW33,LOOKUP!$Y$2:$Z$27,2,FALSE)","v":14},"",""]
[null,13,15,"","","",null,"","","",13,null,15,"","","",15,"O",null,"","","",25,null,15,"","","",15,null,"","","",26,null,15,"","","",15,null,"",null,"","",{"$f":"VLOOKUP($AV34,LOOKUP!$Y$2:$Z$27,2,FALSE)","v":15},"","O","O","",{"$f":"VLOOKUP($AW34,LOOKUP!$Y$2:$Z$27,2,FALSE)","v":15},"",""]
[null,9,16,"","","",null,"","","",20,null,16,"","","",16,"P",null,"","","",21,null,16,"","","",16,null,"","","",8,null,16,"","","",16,null,"",null,"","",{"$f":"VLOOKUP($AV35,LOOKUP!$Y$2:$Z$27,2,FALSE)","v":16},"","P","P","",{"$f":"VLOOKUP($AW35,LOOKUP!$Y$2:$Z$27,2,FALSE)","v":16},"",""]
[null,5,17,"","","",null,"","","",8,"X",17,"","","",17,"Q",null,"","","",17,null,17,"","","",17,null,"","","",25,null,17,"","","",17,null,"",null,"","",{"$f":"VLOOKUP($AV36,LOOKUP!$Y$2:$Z$27,2,FALSE)","v":17},"","Q","Q","",{"$f":"VLOOKUP($AW36,LOOKUP!$Y$2:$Z$27,2,FALSE)","v":17},"",""]
[null,2,18,"","","",null,"","","",24,null,18,"<-",18,"",18,"R",null,7,"","<-",7,null,18,"","","",18,null,"","","",9,null,18,"","","",18,null,"",null,"","",{"$f":"VLOOKUP($AV37,LOOKUP!$Y$2:$Z$27,2,FALSE)","v":18},"","R","R","",{"$f":"VLOOKUP($AW37,LOOKUP!$Y$2:$Z$27,2,FALSE)","v":18},"",""]
[null,6,19,"","","",null,"","","",19,null,19,"","","",19,"S",null,"","","",5,null,19,"","","",19,null,"","","",24,null,19,"<-",19,"",19,null,"<-",null,19,"",{"$f":"VLOOKUP($AV38,LOOKUP!$Y$2:$Z$27,2,FALSE)","v":19},"<-","S","S","<-",{"$f":"VLOOKUP($AW38,LOOKUP!$Y$2:$Z$27,2,FALSE)","v":19},19,""]
[null,26,20,"","","",null,"","","",12,null,20,"","","",20,"T",null,"","","",14,null,20,"","","",20,null,"","","",10,null,20,"","","",20,null,"",null,"","",{"$f":"VLOOKUP($AV39,LOOKUP!$Y$2:$Z$27,2,FALSE)","v":20},"","T","T","",{"$f":"VLOOKUP($AW39,LOOKUP!$Y$2:$Z$27,2,FALSE)","v":20},"",""]
[null,3,21,3,"","<-",null,18,"","<-",18,null,21,"","","",21,"U",null,"","","",8,null,21,"","","",21,null,"","","",23,null,21,"","","",21,null,"",null,"","",{"$f":"VLOOKUP($AV40,LOOKUP!$Y$2:$Z$27,2,FALSE)","v":21},"","U","U","",{"$f":"VLOOKUP($AW40,LOOKUP!$Y$2:$Z$27,2,FALSE)","v":21},"",""]
[null,23,22,"","","",null,"","","",9,null,22,"","","",22,"V",null,"","","",24,null,22,"->","",22,22,null,"",12,"->",12,"X",22,"","","",22,null,"",null,"","",{"$f":"VLOOKUP($AV41,LOOKUP!$Y$2:$Z$27,2,FALSE)","v":22},"","V","V","",{"$f":"VLOOKUP($AW41,LOOKUP!$Y$2:$Z$27,2,FALSE)","v":22},"",""]
[null,22,23,"","","",null,"","","",14,null,23,"","","",23,"W",null,"","","",13,null,23,"","","",23,null,"","","",18,null,23,"","","",23,null,"",null,"","",{"$f":"VLOOKUP($AV42,LOOKUP!$Y$2:$Z$27,2,FALSE)","v":23},"","W","W","",{"$f":"VLOOKUP($AW42,LOOKUP!$Y$2:$Z$27,2,FALSE)","v":23},"",""]
[null,10,24,"","","",null,"","","",17,null,24,"","","",24,"X",null,"","","",9,null,24,"","","",24,null,"","","",11,null,24,"","","",24,null,"",null,"","",{"$f":"VLOOKUP($AV43,LOOKUP!$Y$2:$Z$27,2,FALSE)","v":24},"","X","X","",{"$f":"VLOOKUP($AW43,LOOKUP!$Y$2:$Z$27,2,FALSE)","v":24},"",""]
[null,1,25,"","","",null,"","","",15,null,25,"->","",25,25,"Y",null,"",22,"->",22,null,25,"","","",25,null,"","","",15,null,25,"","","",25,null,"",null,"","",{"$f":"VLOOKUP($AV44,LOOKUP!$Y$2:$Z$27,2,FALSE)","v":25},"","Y","Y","",{"$f":"VLOOKUP($AW44,LOOKUP!$Y$2:$Z$27,2,FALSE)","v":25},"",""]
[null,20,26,"","","",null,"",{"$f":"IF($E$17=E45,K45,\"\")","v":""},"",10,null,26,"","","",26,"Z",null,"","","",19,null,26,"","","",26,null,"","","",13,null,26,"","","",26,null,"",null,"","",{"$f":"VLOOKUP($AV45,LOOKUP!$Y$2:$Z$27,2,FALSE)","v":26},"","Z","Z","",{"$f":"VLOOKUP($AW45,LOOKUP!$Y$2:$Z$27,2,FALSE)","v":26},"",""]
[]
[]
[null,"ENCRPYTED",null,null,null,null,null,null,null,null,null,null,null,null,null,null,null,null,null,null,null,null,null,null,null,null,null,null,null,null,null,null,null,null,null,"ENCRYPTED LETTER",null,null,null,null,null,null,null,null,null,null,null,null,{"$f":"INDEX(AV20:AV45,BA17,1)","v":"L"}]
[]
[]
[]
[]
[]
[]
[null,null,null,null,null,null,null,null,null,null,null,null,null,null,null,null,null,null,null,null,null,null,null,null,null,null,null,null,null,null,null,null,null,null,null,null,null,null,null,null,null,null,null,null,null,null,null,null,null,null,null,null,null,null,null,null,null,null,null,null,null,"X","Y1","Y2","Y3","Y4","Y5","Y6","Y7","Y8","Y9","Y10","Y11","Y12","Y13","Y14","Y15","Y16","Y17","Y18","Y19","Y20","Y21","Y22","Y23","Y24","Y25","Y26","Y_L","Y_R"]
[null,null,null,null,null,null,null,null,null,null,null,null,null,null,null,null,null,null,null,null,null,null,null,null,null,null,null,null,null,null,null,null,null,null,null,null,null,null,null,null,null,null,null,null,null,null,null,null,null,null,null,null,null,null,null,null,null,null,null,null,null,"Start",{"$f":"BK57","v":1},{"$f":"INDEX($AJ$20:$AJ$45,BL$57,1)","v":2},3,4,5,6,7,8,9,10,11,12,13,14,15,16,17,18,19,20,21,22,23,24,25,26,{"$f":"CK57","v":19},{"$f":"CL57","v":12}]
[null,null,null,null,null,null,null,null,null,null,null,null,null,null,null,null,null,null,null,null,null,null,null,null,null,null,null,null,null,null,null,null,null,null,null,null,null,null,null,null,null,null,null,null,null,null,null,null,null,null,null,null,null,null,null,null,null,null,null,null,null,"Index",1,2,3,4,5,6,7,8,9,10,11,12,13,14,15,16,17,18,19,20,21,22,23,24,25,26,{"$f":"AR17","v":19},{"$f":"BA17","v":12}]
[null,null,null,null,null,null,null,null,null,null,null,null,null,null,null,null,null,null,null,null,null,null,null,null,null,null,null,null,null,null,null,null,null,null,null,null,null,null,null,null,null,null,null,null,null,null,null,null,null,null,null,null,null,null,null,null,null,null,null,null,null,"End",{"$f":"MATCH(INDEX($AJ$20:$AJ$45,BK$57,1),$AH$20:$AH$45,0)","v":2},4,6,8,10,12,3,16,18,20,24,22,26,14,25,5,9,23,7,1,11,13,21,19,17,15,{"$f":"MATCH(INDEX($AJ$20:$AJ$45,CK$57,1),$AH$20:$AH$45,0)","v":7},{"$f":"MATCH(INDEX($AJ$20:$AJ$45,CL$57,1),$AH$20:$AH$45,0)","v":22}]
[]
[null,null,null,null,null,null,null,null,null,null,null,null,null,null,null,null,null,null,null,null,null,null,null,null,null,null,null,null,null,null,null,null,null,null,null,null,null,null,null,null,null,null,null,null,null,null,null,null,null,null,null,null,null,null,null,null,null,null,null,null,null,"X","Y1","Y2","Y3","Y4","Y5","Y6","Y7","Y8","Y9","Y10","Y11","Y12","Y13","Y14","Y15","Y16","Y17","Y18","Y19","Y20","Y21","Y22","Y23","Y24","Y25","Y26","Y_L","Y_R"]
{"$rows_left_out":35}
{"sheet":"LOOKUP","index":1,"n_rows":28,"n_cols":32,"rows_kept":28,"cut":false,"hidden":false,"merged":[[0,12,0,14],[0,16,0,18],[0,20,0,22],[0,4,0,6],[0,8,0,10]]}
["STECKER_NO","START_POS","WHEEL",null,"WHEEL V",null,null,null,"WHEEL IV",null,null,null,"WHEEL III",null,null,null,"WHEEL II",null,null,null,"WHEEL I",null,null,null,null,null,null,null,null,"AJDKSIRUXBLHWTMCQGZNPYFVOE"]
[1,1,"I",null,"LINK",null,"INDEX",null,"LINK",null,"INDEX",null,"LINK",null,"INDEX",null,"LINK",null,"INDEX",null,"LINK",null,"INDEX",null,"A",1,"A",null,null,{"$f":"RIGHT(LEFT($AD$1,Z2),1)","v":"A"},{"$f":"VLOOKUP($AD2,$Y$2:$Z$27,2,FALSE)","v":1},{"$f":"MATCH($W3,$AE$2:$AE$27,0)","v":1}]
[2,2,"II",null,22,null,1,null,5,null,1,null,2,null,1,null,1,null,1,null,5,null,1,null,"B",2,"B",null,null,{"$f":"RIGHT(LEFT($AD$1,Z3),1)","v":"J"},{"$f":"VLOOKUP($AD3,$Y$2:$Z$27,2,FALSE)","v":10},{"$f":"MATCH($W4,$AE$2:$AE$27,0)","v":10}]
[3,3,"III",null,26,null,2,null,18,null,2,null,4,null,2,null,10,null,2,null,11,null,2,null,"C",3,"C",null,null,"D",4,16]
[4,4,"IV",null,2,null,3,null,15,null,3,null,6,null,3,null,4,null,3,null,13,null,3,null,"D",4,"D",null,null,"K",11,3]
[5,5,"V",null,18,null,4,null,22,null,4,null,8,null,4,null,11,null,4,null,6,null,4,null,"E",5,"E",null,null,"S",19,26]
[6,6,null,null,7,null,5,null,16,null,5,null,10,null,5,null,19,"X",5,null,12,null,5,null,"F",6,"F",null,null,"I",9,23]
[7,7,null,null,9,null,6,null,26,null,6,null,12,null,6,null,9,null,6,null,7,null,6,null,"G",7,"G",null,null,"R",18,18]
[8,8,null,null,20,null,7,null,10,null,7,null,3,null,7,null,18,null,7,null,4,null,7,null,"H",8,"H",null,null,"U",21,12]
[9,9,null,null,25,null,8,null,1,null,8,null,16,null,8,null,21,null,8,null,17,null,8,null,"I",9,"I",null,null,"X",24,6]
[10,10,null,null,21,null,9,null,25,null,9,null,18,null,9,null,24,null,9,null,22,null,9,null,"J",10,"J",null,null,"B",2,2]
[null,11,null,null,16,null,10,null,17,"X",10,null,20,null,10,null,2,null,10,null,26,null,10,null,"K",11,"K",null,null,"L",12,4]
[null,12,null,null,19,null,11,null,21,null,11,null,24,null,11,null,12,null,11,null,14,null,11,null,"L",12,"L",null,null,"H",8,11]
[null,13,null,null,4,null,12,null,9,null,12,null,22,null,12,null,8,null,12,null,20,null,12,null,"M",13,"M",null,null,"W",23,15]
[null,14,null,null,14,null,13,null,18,null,13,null,26,null,13,null,23,null,13,null,15,null,13,null,"N",14,"N",null,null,"T",20,20]
[null,15,null,null,8,null,14,null,8,null,14,null,14,null,14,null,20,null,14,null,23,null,14,null,"O",15,"O",null,null,"M",13,25]
[null,16,null,null,12,null,15,null,24,null,15,null,25,null,15,null,13,null,15,null,25,null,15,null,"P",16,"P",null,null,"C",3,21]
[null,17,null,null,24,null,16,null,12,null,16,null,5,null,16,null,3,null,16,null,8,null,16,null,"Q",17,"Q",null,null,"Q",17,17]
[null,18,null,null,1,null,17,null,14,null,17,null,9,null,17,null,17,null,17,null,24,"X",17,null,"R",18,"R",null,null,"G",7,7]
[null,19,null,null,23,null,18,null,6,null,18,null,23,null,18,null,7,null,18,null,21,null,18,null,"S",19,"S",null,null,"Z",26,5]
[null,20,null,null,13,null,19,null,20,null,19,null,7,null,19,null,26,null,19,null,19,null,19,null,"T",20,"T",null,null,"N",14,14]
[null,21,null,null,10,null,20,null,7,null,20,null,1,null,20,null,14,null,20,null,16,null,20,null,"U",21,"U",null,null,"P",16,8]
[null,22,null,null,17,null,21,null,11,null,21,null,11,null,21,null,16,null,21,null,1,null,21,null,"V",22,"V",null,null,"Y",25,24]
[null,23,null,null,15,null,22,null,4,null,22,null,13,"X",22,null,25,null,22,null,9,null,22,null,"W",23,"W",null,null,"F",6,13]
[null,24,null,null,6,null,23,null,3,null,23,null,21,null,23,null,6,null,23,null,2,null,23,null,"X",24,"X",null,null,"V",22,9]
[null,25,null,null,5,null,24,null,13,null,24,null,19,null,24,null,22,null,24,null,18,null,24,null,"Y",25,"Y",null,null,"O",15,22]
[null,26,null,null,3,null,25,null,23,null,25,null,17,null,25,null,15,null,25,null,3,null,25,null,"Z",26,"Z",null,null,"E",5,19]
[null,null,null,null,11,"X",26,null,2,null,26,null,15,null,26,null,5,null,26,null,10,null,26]